现在时间是:

[开源]authlib

时间:2018-12-02 来源:[db:来源] 作者:[db:作者] 点击:加载中..
  

  编译出产即兴

  [ERROR] COMPILATION ERROR :

  [INFO] -------------------------------------------------------------

  [ERROR] No compiler is provided in this environment. Perhaps you are running on a JRE rather than a JDK?

  [INFO] 1 error

  [INFO] -------------------------------------------------------------

  [INFO] ------------------------------------------------------------------------

  [INFO] Reactor Summary:

  [INFO]

  [INFO] authlib-agent-parent ............................... SUCCESS [ 5.930 s]

  [INFO] authlib-javaagent .................................. FAILURE [ 1.591 s]

  [INFO] yggdrasil-backend .................................. SKIPPED

  [INFO] ------------------------------------------------------------------------

  [INFO] BUILD FAILURE

  [INFO] ------------------------------------------------------------------------

  [INFO] Total time: 7.913 s

  [INFO] Finished at: 2017-08-18T21:11:07+08:00

  [INFO] Final Memory: 11M/28M

  [INFO] ------------------------------------------------------------------------

  [ERROR] Failed to execute goal org.apache.maven.plugins:maven-compiler-plugin:3.3:compile (default-compile) on project authlib-javaagent: Compilation failure

  [ERROR] No compiler is provided in this environment. Perhaps you are running on a JRE rather than a JDK?

  [ERROR]

  [ERROR] -> [Help 1]

  [ERROR]

  [ERROR] To see the full stack trace of the errors, re-run Maven with the -e switch.

  [ERROR] Re-run Maven using the -X switch to enable full debug logging.

  [ERROR]

  [ERROR] For more information about the errors and possible solutions, please read the following articles:

  [ERROR] [Help 1] http://cwiki.apache.org/confluence/display/MAVEN/MojoFailureException

  [ERROR]

  [ERROR] After correcting the problems, you can resume the build with the command

  [ERROR] mvn -rf :authlib-javaagent

  cp: 无法获取"http://www.mcbbs.net/authlib-javaagent/target/authlib-javaagent-*-jar-with-dependencies.jar" 的文件样儿子(stat): 没拥有拥有阿谁文件或目次

  http://www.mcbbs.net/authlib-javaagent/target/authlib-javaagent-*-jar-with-dependencies.jar is saved to authlibagent.jar

  cp: 无法获取"http://www.mcbbs.net/yggdrasil-backend/target/yggdrasil-backend-*.war" 的文件样儿子(stat): 没拥有拥有阿谁文件或目次

  http://www.mcbbs.net/yggdrasil-backend/target/yggdrasil-backend-*.war is saved to yggdrasil-backend.war

  骈制代码

(责任编辑:admin)

------分隔线----------------------------
最新评论 查看所有评论
加载中......
发表评论 查看所有评论